{"text_format":"1","workbook":"xlsx","n_sheets":15,"sheets":["стр1","к стр1","стр2","стр3","к стр 3 и 7","стр4","к стр 4","стр5","к стр 5","стр6","к стр 6","стр7","стр8","к стр8 и 9","стр9"],"not_rendered":{"charts":14,"images":0,"macros":1,"external_links":0,"defined_names":14,"comments":0,"pivot_tables":0},"unopened":[],"bounds":{"document_bytes":16777216,"sheet_cells":100000,"rows_first":2000,"rows_last":500,"rows_between":2000,"halvings":0,"cell_chars":16384,"cell_head_chars":4096},"cells_cut":0,"cells_raw":0,"read":"whole","date_system":"1900"}

{"sheet":"стр1","index":0,"n_rows":33,"n_cols":1,"rows_kept":33,"cut":false,"hidden":false,"merged":[[32,0,33,13]]}
[]
[]
[]
[]
[]
[]
{"$rows_left_out":28}
{"sheet":"к стр1","index":1,"n_rows":22,"n_cols":34,"rows_kept":22,"cut":false,"hidden":true,"merged":[]}
[null,null,null,null,null,null,null,null,"00",null,6182.0965999999999,null,"РЕСПУБЛИКА КАЗАХСТАН",589.42700000000002]
[null,null,null,null,null,null,null,null,35,"Карагандинская",932.99490000000003,null,null,null,null,null,null,null,null,null,null,null,null,null,null,null,null,null,null,null,null,null,"Атырауская",43.18008298755187]
[null,null,null,null,null,null,null,null,19,"Алматинская",591.27700000000004,null,"Карагандинская",75.334999999999994,null,null,null,null,null,null,null,null,null,null,null,null,null,null,null,null,null,null,"Костанайская",36.821687413554635]
[null,null,null,null,null,null,null,null,63,"ВКО",520.48300000000006,null,"г. Алматы",61.59,null,null,null,null,null,null,null,null,null,null,null,null,null,null,null,null,null,null,"г.Шымкент",29.866666666666667]
[null,null,null,null,null,null,null,null,39,"Костанайская",471.59280000000001,null,"Павлодарская",56.792999999999999,null,null,null,null,null,null,null,null,null,null,null,null,null,null,null,null,null,null,"Карагандинская",29.683430152143846]
[null,null,null,null,null,null,null,null,75,"г.Алматы",434.77059999999994,null,"Алматинская",52.411999999999999,null,null,null,null,null,null,null,null,null,null,null,null,null,null,null,null,null,null,"Абай",29.107607192254495]
{"$rows_left_out":17}
{"sheet":"стр2","index":2,"n_rows":133,"n_cols":10,"rows_kept":133,"cut":false,"hidden":false,"merged":[[0,0,0,9]]}
["Отдельные показатели индустриального развития по Республике Казахстан и областям за 2015 – 2022 годы"]
["Наименование показателей","2014 год","2015 год","2016 год","2017 год","2018 год","2019 год","2020 год","2021 год","2022 год"]
["Объем производства обрабатывающей продукции, млрд. тенге",6092.1938060000002,5978.0078839999996,8046.8445119999997,9400.8481790000005,10403.854079000001,11573.349555999999,13232.695576,17121.392371999998,21161.830028]
["Абай","...","..","..","..","..","..","..","..",482.21635099999997]
["Акмолинская",223.10433499999999,231.41514599999999,329.30918200000002,444.04193800000002,533.06857600000001,641.93046900000002,867.11827900000003,931.29648699999996,1224.67623]
["Актюбинская",258.75842999999998,264.391435,367.51142599999997,531.50813300000004,606.53396199999997,605.30023300000005,569.692184,840.25761499999999,1169.5734170000001]
{"$rows_left_out":128}
{"sheet":"стр3","index":3,"n_rows":20,"n_cols":6,"rows_kept":20,"cut":false,"hidden":false,"merged":[[0,1,0,4]]}
[null,"Объем промышленного производства по видам экономической деятельности, млрд. тг."]
[null,"Виды экономической\nдеятельности","январь-сентябрь 2022","январь-сентябрь 2023","ИФО январь-сентябрь 2023 года к январю-сентябрю 2022, %"]
["C","Обрабатывающая промышленность",{"$f":"VLOOKUP($A3,'к стр 3 и 7'!$A:$I,6,0)/1000000","v":15230.10009},{"$f":"VLOOKUP($A3,'к стр 3 и 7'!$A:$I,7,0)/1000000","v":15890.096834},{"$f":"VLOOKUP($A3,'к стр 3 и 7'!$A:$I,9,0)","v":103.2},"C"]
["10","Производство продуктов питания",{"$f":"VLOOKUP($A4,'к стр 3 и 7'!$A:$I,6,0)/1000000","v":2089.7389240000002},{"$f":"VLOOKUP($A4,'к стр 3 и 7'!$A:$I,7,0)/1000000","v":2339.7919339999999},{"$f":"VLOOKUP($A4,'к стр 3 и 7'!$A:$I,9,0)","v":103.3},"10"]
["11","Производство напитков",{"$f":"VLOOKUP($A5,'к стр 3 и 7'!$A:$I,6,0)/1000000","v":554.91520800000001},{"$f":"VLOOKUP($A5,'к стр 3 и 7'!$A:$I,7,0)/1000000","v":699.94211099999995},{"$f":"VLOOKUP($A5,'к стр 3 и 7'!$A:$I,9,0)","v":103.2},"11"]
["12","Производство табачных изделий",{"$f":"VLOOKUP($A6,'к стр 3 и 7'!$A:$I,6,0)/1000000","v":206.48245700000001},{"$f":"VLOOKUP($A6,'к стр 3 и 7'!$A:$I,7,0)/1000000","v":209.693907},{"$f":"VLOOKUP($A6,'к стр 3 и 7'!$A:$I,9,0)","v":97.8},"12"]
{"$rows_left_out":15}
{"sheet":"к стр 3 и 7","index":4,"n_rows":854,"n_cols":9,"rows_kept":854,"cut":false,"hidden":true,"merged":[]}
[null,2,3,4,5,6,7,8,9]
[null,"инвестиции, тыс. тенге","инвестиции, тыс. тенге","ифо инвестиции, %","ифо инвестиции, %","произв-во МН, тыс. тенге","произв-во МН, тыс. тенге","ифо пр-во МН,%","ифо пр-во МН,%"]
[null,"2022 г.","2023 г.","2022 г.","2023 г.","2022 г.","2023 г.","2022 г.","2023 г."]
["окэд","Сентябрь","Сентябрь","Сентябрь","Сентябрь","Сентябрь","Сентябрь","Сентябрь","Сентябрь"]
["BCDE",4896363972,5574807631,103.6,108.2,35963157444,33972775208,102.1,104.4]
["B",3147856174,3448151833,110.7,104.4,18826661614,15925139081,100.1,105.4]
{"$rows_left_out":849}
{"sheet":"стр4","index":5,"n_rows":21,"n_cols":23,"rows_kept":21,"cut":false,"hidden":false,"merged":[[0,1,0,22]]}
[null,"Объем промышленного производства по видам экономической деятельности в разрезе РК и регионов, млрд. тг."]
[null,"январь-сентябрь 2023 г.","РК","Акмолинская","Актюбинская","Алматинская","Атырауская","ЗКО","Жамбылская","Карагандинская","Костанайская","Кызылординская","Мангыстауская","Павлодарская","СКО","Туркестанская","ВКО","Астана","Алматы","Шымкент","Абай","Жетісу","Ұлытау"]
["BCDE","Промышленность",{"$f":"VLOOKUP($A3,'к стр 4'!$A:$V,'к стр 4'!B$1,0)/1000000","v":33972.775207999999},{"$f":"VLOOKUP($A3,'к стр 4'!$A:$V,'к стр 4'!C$1,0)/1000000","v":1266.2591480000001},{"$f":"VLOOKUP($A3,'к стр 4'!$A:$V,'к стр 4'!D$1,0)/1000000","v":1828.4047370000001},{"$f":"VLOOKUP($A3,'к стр 4'!$A:$V,'к стр 4'!E$1,0)/1000000","v":1302.090745},{"$f":"VLOOKUP($A3,'к стр 4'!$A:$V,'к стр 4'!F$1,0)/1000000","v":8092.5617769999999},{"$f":"VLOOKUP($A3,'к стр 4'!$A:$V,'к стр 4'!G$1,0)/1000000","v":2564.7720429999999},{"$f":"VLOOKUP($A3,'к стр 4'!$A:$V,'к стр 4'!H$1,0)/1000000","v":634.33975199999998},{"$f":"VLOOKUP($A3,'к стр 4'!$A:$V,'к стр 4'!I$1,0)/1000000","v":2539.0794850000002},{"$f":"VLOOKUP($A3,'к стр 4'!$A:$V,'к стр 4'!J$1,0)/1000000","v":1950.7052859999999},{"$f":"VLOOKUP($A3,'к стр 4'!$A:$V,'к стр 4'!K$1,0)/1000000","v":763.59671400000002},{"$f":"VLOOKUP($A3,'к стр 4'!$A:$V,'к стр 4'!L$1,0)/1000000","v":2059.4455790000002},{"$f":"VLOOKUP($A3,'к стр 4'!$A:$V,'к стр 4'!M$1,0)/1000000","v":2259.5657230000002},{"$f":"VLOOKUP($A3,'к стр 4'!$A:$V,'к стр 4'!N$1,0)/1000000","v":457.63050900000002},{"$f":"VLOOKUP($A3,'к стр 4'!$A:$V,'к стр 4'!O$1,0)/1000000","v":680.60997399999997},{"$f":"VLOOKUP($A3,'к стр 4'!$A:$V,'к стр 4'!P$1,0)/1000000","v":1795.459394},{"$f":"VLOOKUP($A3,'к стр 4'!$A:$V,'к стр 4'!Q$1,0)/1000000","v":1431.8624380000001},{"$f":"VLOOKUP($A3,'к стр 4'!$A:$V,'к стр 4'!R$1,0)/1000000","v":1464.37697},{"$f":"VLOOKUP($A3,'к стр 4'!$A:$V,'к стр 4'!S$1,0)/1000000","v":764.25757199999998},{"$f":"VLOOKUP($A3,'к стр 4'!$A:$V,'к стр 4'!T$1,0)/1000000","v":1101.1392619999999},{"$f":"VLOOKUP($A3,'к стр 4'!$A:$V,'к стр 4'!U$1,0)/1000000","v":230.05109300000001},{"$f":"VLOOKUP($A3,'к стр 4'!$A:$V,'к стр 4'!V$1,0)/1000000","v":786.56700599999999}]
["C","Обрабатывающая промышленность",{"$f":"VLOOKUP($A4,'к стр 4'!$A:$V,'к стр 4'!B$1,0)/1000000","v":15890.096834},{"$f":"VLOOKUP($A4,'к стр 4'!$A:$V,'к стр 4'!C$1,0)/1000000","v":998.84089300000005},{"$f":"VLOOKUP($A4,'к стр 4'!$A:$V,'к стр 4'!D$1,0)/1000000","v":742.18504700000005},{"$f":"VLOOKUP($A4,'к стр 4'!$A:$V,'к стр 4'!E$1,0)/1000000","v":1178.2467509999999},{"$f":"VLOOKUP($A4,'к стр 4'!$A:$V,'к стр 4'!F$1,0)/1000000","v":516.84726999999998},{"$f":"VLOOKUP($A4,'к стр 4'!$A:$V,'к стр 4'!G$1,0)/1000000","v":218.23814400000001},{"$f":"VLOOKUP($A4,'к стр 4'!$A:$V,'к стр 4'!H$1,0)/1000000","v":454.29839099999998},{"$f":"VLOOKUP($A4,'к стр 4'!$A:$V,'к стр 4'!I$1,0)/1000000","v":1898.439597},{"$f":"VLOOKUP($A4,'к стр 4'!$A:$V,'к стр 4'!J$1,0)/1000000","v":1415.200118},{"$f":"VLOOKUP($A4,'к стр 4'!$A:$V,'к стр 4'!K$1,0)/1000000","v":227.272626},{"$f":"VLOOKUP($A4,'к стр 4'!$A:$V,'к стр 4'!L$1,0)/1000000","v":163.099659},{"$f":"VLOOKUP($A4,'к стр 4'!$A:$V,'к стр 4'!M$1,0)/1000000","v":1396.0881019999999},{"$f":"VLOOKUP($A4,'к стр 4'!$A:$V,'к стр 4'!N$1,0)/1000000","v":384.81335999999999},{"$f":"VLOOKUP($A4,'к стр 4'!$A:$V,'к стр 4'!O$1,0)/1000000","v":310.57082800000001},{"$f":"VLOOKUP($A4,'к стр 4'!$A:$V,'к стр 4'!P$1,0)/1000000","v":1594.9292150000001},{"$f":"VLOOKUP($A4,'к стр 4'!$A:$V,'к стр 4'!Q$1,0)/1000000","v":1293.731272},{"$f":"VLOOKUP($A4,'к стр 4'!$A:$V,'к стр 4'!R$1,0)/1000000","v":1264.3063079999999},{"$f":"VLOOKUP($A4,'к стр 4'!$A:$V,'к стр 4'!S$1,0)/1000000","v":672.26033399999994},{"$f":"VLOOKUP($A4,'к стр 4'!$A:$V,'к стр 4'!T$1,0)/1000000","v":403.45690500000001},{"$f":"VLOOKUP($A4,'к стр 4'!$A:$V,'к стр 4'!U$1,0)/1000000","v":183.89458999999999},{"$f":"VLOOKUP($A4,'к стр 4'!$A:$V,'к стр 4'!V$1,0)/1000000","v":573.37742500000002}]
["10","Производство продуктов питания",{"$f":"VLOOKUP($A5,'к стр 4'!$A:$V,'к стр 4'!B$1,0)/1000000","v":2339.7919339999999},{"$f":"VLOOKUP($A5,'к стр 4'!$A:$V,'к стр 4'!C$1,0)/1000000","v":165.42853500000001},{"$f":"VLOOKUP($A5,'к стр 4'!$A:$V,'к стр 4'!D$1,0)/1000000","v":63.825750999999997},{"$f":"VLOOKUP($A5,'к стр 4'!$A:$V,'к стр 4'!E$1,0)/1000000","v":290.70975900000002},{"$f":"VLOOKUP($A5,'к стр 4'!$A:$V,'к стр 4'!F$1,0)/1000000","v":12.717942000000001},{"$f":"VLOOKUP($A5,'к стр 4'!$A:$V,'к стр 4'!G$1,0)/1000000","v":73.248165999999998},{"$f":"VLOOKUP($A5,'к стр 4'!$A:$V,'к стр 4'!H$1,0)/1000000","v":88.559810999999996},{"$f":"VLOOKUP($A5,'к стр 4'!$A:$V,'к стр 4'!I$1,0)/1000000","v":119.95904400000001},{"$f":"VLOOKUP($A5,'к стр 4'!$A:$V,'к стр 4'!J$1,0)/1000000","v":312.74451099999999},{"$f":"VLOOKUP($A5,'к стр 4'!$A:$V,'к стр 4'!K$1,0)/1000000","v":81.501739000000001},{"$f":"VLOOKUP($A5,'к стр 4'!$A:$V,'к стр 4'!L$1,0)/1000000","v":7.7513540000000001},{"$f":"VLOOKUP($A5,'к стр 4'!$A:$V,'к стр 4'!M$1,0)/1000000","v":118.54278499999999},{"$f":"VLOOKUP($A5,'к стр 4'!$A:$V,'к стр 4'!N$1,0)/1000000","v":190.03693699999999},{"$f":"VLOOKUP($A5,'к стр 4'!$A:$V,'к стр 4'!O$1,0)/1000000","v":92.908462999999998},{"$f":"VLOOKUP($A5,'к стр 4'!$A:$V,'к стр 4'!P$1,0)/1000000","v":166.56682599999999},{"$f":"VLOOKUP($A5,'к стр 4'!$A:$V,'к стр 4'!Q$1,0)/1000000","v":55.063965000000003},{"$f":"VLOOKUP($A5,'к стр 4'!$A:$V,'к стр 4'!R$1,0)/1000000","v":235.29764599999999},{"$f":"VLOOKUP($A5,'к стр 4'!$A:$V,'к стр 4'!S$1,0)/1000000","v":109.588112},{"$f":"VLOOKUP($A5,'к стр 4'!$A:$V,'к стр 4'!T$1,0)/1000000","v":85.686346},{"$f":"VLOOKUP($A5,'к стр 4'!$A:$V,'к стр 4'!U$1,0)/1000000","v":65.381226999999996},{"$f":"VLOOKUP($A5,'к стр 4'!$A:$V,'к стр 4'!V$1,0)/1000000","v":4.2730160000000001}]
["11","Производство напитков",{"$f":"VLOOKUP($A6,'к стр 4'!$A:$V,'к стр 4'!B$1,0)/1000000","v":699.94211099999995},{"$f":"VLOOKUP($A6,'к стр 4'!$A:$V,'к стр 4'!C$1,0)/1000000","v":16.972521},{"$f":"VLOOKUP($A6,'к стр 4'!$A:$V,'к стр 4'!D$1,0)/1000000","v":14.298031999999999},{"$f":"VLOOKUP($A6,'к стр 4'!$A:$V,'к стр 4'!E$1,0)/1000000","v":335.79868399999998},{"$f":"VLOOKUP($A6,'к стр 4'!$A:$V,'к стр 4'!F$1,0)/1000000","v":0.78448899999999999},{"$f":"VLOOKUP($A6,'к стр 4'!$A:$V,'к стр 4'!G$1,0)/1000000","v":2.1375760000000001},{"$f":"VLOOKUP($A6,'к стр 4'!$A:$V,'к стр 4'!H$1,0)/1000000","v":3.348671},{"$f":"VLOOKUP($A6,'к стр 4'!$A:$V,'к стр 4'!I$1,0)/1000000","v":32.539757000000002},{"$f":"VLOOKUP($A6,'к стр 4'!$A:$V,'к стр 4'!J$1,0)/1000000","v":30.417988999999999},{"$f":"VLOOKUP($A6,'к стр 4'!$A:$V,'к стр 4'!K$1,0)/1000000","v":7.9606999999999997E-2},{"$f":"VLOOKUP($A6,'к стр 4'!$A:$V,'к стр 4'!L$1,0)/1000000","v":0.30321599999999999},{"$f":"VLOOKUP($A6,'к стр 4'!$A:$V,'к стр 4'!M$1,0)/1000000","v":3.2737080000000001},{"$f":"VLOOKUP($A6,'к стр 4'!$A:$V,'к стр 4'!N$1,0)/1000000","v":9.0366870000000006},{"$f":"VLOOKUP($A6,'к стр 4'!$A:$V,'к стр 4'!O$1,0)/1000000","v":11.659262},{"$f":"VLOOKUP($A6,'к стр 4'!$A:$V,'к стр 4'!P$1,0)/1000000","v":0.73357499999999998},{"$f":"VLOOKUP($A6,'к стр 4'!$A:$V,'к стр 4'!Q$1,0)/1000000","v":118.70054},{"$f":"VLOOKUP($A6,'к стр 4'!$A:$V,'к стр 4'!R$1,0)/1000000","v":73.688338999999999},{"$f":"VLOOKUP($A6,'к стр 4'!$A:$V,'к стр 4'!S$1,0)/1000000","v":28.033944000000002},{"$f":"VLOOKUP($A6,'к стр 4'!$A:$V,'к стр 4'!T$1,0)/1000000","v":0.112335},{"$f":"VLOOKUP($A6,'к стр 4'!$A:$V,'к стр 4'!U$1,0)/1000000","v":17.854634999999998},{"$f":"VLOOKUP($A6,'к стр 4'!$A:$V,'к стр 4'!V$1,0)/1000000","v":0.168545}]
{"$rows_left_out":16}
{"sheet":"к стр 4","index":6,"n_rows":815,"n_cols":22,"rows_kept":815,"cut":false,"hidden":true,"merged":[]}
[null,2,3,4,5,6,7,8,9,10,11,12,13,14,15,16,17,18,19,20,21,22]
[null,"РК","Акмолинская","Актюбинская","Алматинская","Атырауская","ЗКО","Жамбылская","Карагандинская","Костанайская","Кызылординская","Мангыстауская","Павлодарская","СКО","Туркестанская","ВКО","Астана","Алматы","Шымкент","Абай","Жетісу","Ұлытау"]
["окэд","00","11","15","19","23","27","31","35","39","43","47","55","59","61","63","71","75","79","10","33","62"]
["BCDE",33972775208,1266259148,1828404737,1302090745,8092561777,2564772043,634339752,2539079485,1950705286,763596714,2059445579,2259565723,457630509,680609974,1795459394,1431862438,1464376970,764257572,1101139262,230051093,786567006]
["B",15925139081,154861373,962389382,8412926,7461248870,2286325584,78191925,452484764,481616450,491389303,1756740262,515839619,8858400,316088382,104870375,null,null,894971,664027823,6407848,174490823]
["C",15890096834,998840893,742185047,1178246751,516847270,218238144,454298391,1898439597,1415200118,227272626,163099659,1396088102,384813360,310570828,1594929215,1293731272,1264306308,672260334,403456905,183894590,573377425]
{"$rows_left_out":810}
{"sheet":"стр5","index":7,"n_rows":0,"n_cols":0,"rows_kept":0,"cut":false,"hidden":false,"merged":[[0,0,0,5],[1,0,1,5],[2,0,3,0]]}

{"sheet":"к стр 5","index":8,"n_rows":32,"n_cols":4,"rows_kept":32,"cut":false,"hidden":true,"merged":[[12,0,12,3]]}
[]
["        Обрабатывающая промышленность",{"$f":"B15","v":15230.10009}]
[{"$f":"$A$16","v":"Металлургия"},{"$f":"$C$16","v":6040.9512759999998},{"$f":"B3/$B$2","v":0.39664554010163433}]
[{"$f":"$A$17","v":"Машиностроение"},{"$f":"$C$17","v":2950.5835499999998},{"$f":"B4/$B$2","v":0.19373369397206633}]
[{"$f":"$A$18","v":"Производство продуктов питания"},{"$f":"$C$18","v":2339.7919339999999},0.15362945221458488]
[{"$f":"$A$19","v":"Кокс и продукты нефтепереработки "},{"$f":"$C$19","v":851.55041400000005},5.5912332090261398E-2]
{"$rows_left_out":27}
{"sheet":"стр6","index":9,"n_rows":0,"n_cols":0,"rows_kept":0,"cut":false,"hidden":false,"merged":[[0,0,0,9]]}

{"sheet":"к стр 6","index":10,"n_rows":33,"n_cols":6,"rows_kept":33,"cut":false,"hidden":true,"merged":[]}
[]
[]
[null,"январь-сентябрь 2022 г.","январь-сентябрь 2023 г.",null,null,-1]
[{"$f":"A17","v":"Металлургия"},-442.36874399999999,{"$f":"C17","v":346.17314699999997},null,{"$f":"(B17)*-1","v":-442.36874399999999}]
[{"$f":"A18","v":"Химическая промышленность"},-127.743482,126.676027,null,-127.743482]
[{"$f":"A19","v":"Производство продуктов питания"},-88.788475000000005,97.590003999999993,null,-88.788475000000005]
{"$rows_left_out":28}
{"sheet":"стр7","index":11,"n_rows":20,"n_cols":6,"rows_kept":20,"cut":false,"hidden":false,"merged":[[0,1,0,5]]}
[null,"Инвестиции в основной капитал по отраслям промышленности РК, млрд. тг."]
[null,"Виды экономической деятельности ","январь-сентябрь 2022","январь-сентябрь 2023","ИФО января-сентября 2023 года к январю-сентябрю 2022, %","Удельный вес , %"]
["C","Обрабатывающая промышленность",{"$f":"VLOOKUP($A3,'к стр 3 и 7'!$A:$I,2,0)/1000000","v":1039.9038619999999},{"$f":"VLOOKUP($A3,'к стр 3 и 7'!$A:$I,3,0)/1000000","v":1027.19228},{"$f":"VLOOKUP($A3,'к стр 3 и 7'!$A:$I,5,0)","v":93.6},19.004106680627871]
["10","Производство продуктов питания",{"$f":"VLOOKUP($A4,'к стр 3 и 7'!$A:$I,2,0)/1000000","v":88.788475000000005},{"$f":"VLOOKUP($A4,'к стр 3 и 7'!$A:$I,3,0)/1000000","v":97.590003999999993},{"$f":"VLOOKUP($A4,'к стр 3 и 7'!$A:$I,5,0)","v":105.9},9.8766930627886147]
["11","Производство напитков",{"$f":"VLOOKUP($A5,'к стр 3 и 7'!$A:$I,2,0)/1000000","v":20.16208},{"$f":"VLOOKUP($A5,'к стр 3 и 7'!$A:$I,3,0)/1000000","v":24.056049999999999},{"$f":"VLOOKUP($A5,'к стр 3 и 7'!$A:$I,5,0)","v":113.9},1.627106787750739]
["12","Производство табачных изделий",{"$f":"VLOOKUP($A6,'к стр 3 и 7'!$A:$I,2,0)/1000000","v":16.425333999999999},{"$f":"VLOOKUP($A6,'к стр 3 и 7'!$A:$I,3,0)/1000000","v":6.6577159999999997},{"$f":"VLOOKUP($A6,'к стр 3 и 7'!$A:$I,5,0)","v":38.299999999999997},0.50448073522547199]
{"$rows_left_out":15}
{"sheet":"стр8","index":12,"n_rows":0,"n_cols":0,"rows_kept":0,"cut":false,"hidden":false,"merged":[]}

{"sheet":"к стр8 и 9","index":13,"n_rows":45,"n_cols":23,"rows_kept":45,"cut":false,"hidden":true,"merged":[]}
[null," Экспорт, тыс. долл. США",null,null,null,null,null,null,null,null,null,null,null,null,null,null,null,null,null," Экспорт, тыс. долл. США"]
["окэд2","2023",null,null,null,null,null,null,null,null,null,null,null,null,null,null,null,"окэд2",null,"2023"]
["01",2112717.5426100013,{"$f":"VLOOKUP(A3,стр9!$A:$K,2,0)","v":{"$error":"#N/A"}},null,null,null,null,null,null,null,null,null,null,null,null,null,null,"c",{"$f":"VLOOKUP(R3,$A:$C,3,0)","v":"Обрабатывающая промышленность"},{"$f":"VLOOKUP(R3,$A:$B,2,0)","v":16208625.786949994}]
["02",481.44781999999998,{"$f":"VLOOKUP(A4,стр9!$A:$K,2,0)","v":{"$error":"#N/A"}},null,null,"Всего экспорт","Экспорт обр пром",null,null,null,null,null,null,null,null,null,null,"24","Металлургическая промышленность",{"$f":"VLOOKUP(R4,$A:$B,2,0)/$T$3","v":0.52510624036200737},null,"Прочие",{"$f":"100%-SUM(W5:W11)","v":0.12176440294087254}]
["03",632.65172999999993,{"$f":"VLOOKUP(A5,стр9!$A:$K,2,0)","v":{"$error":"#N/A"}},null,2014,79.459999999999994,18.38,null,null,null,null,null,null,null,null,null,null,"10","Производство продуктов питания",8.4272553140177855E-2,null,{"$f":"S4","v":"Металлургическая промышленность"},{"$f":"T4","v":0.52510624036200737}]
["05",516631.76058,{"$f":"VLOOKUP(A6,стр9!$A:$K,2,0)","v":{"$error":"#N/A"}},null,2015,45.96,14.03,null,null,null,null,null,null,null,null,null,null,"19","Производство кокса и продуктов нефтепереработки",7.3698191061438503E-2,null,{"$f":"S5","v":"Производство продуктов питания"},{"$f":"T5","v":8.4272553140177855E-2}]
{"$rows_left_out":40}
{"sheet":"стр9","index":14,"n_rows":26,"n_cols":11,"rows_kept":26,"cut":false,"hidden":false,"merged":[[0,1,0,10]]}
[null,"Динамика экспорта обрабатывающей промышленности по видам экономической деятельности, млн. долл. США"]
[null,"Наименование ОКЭД",2015,2016,2017,2018,2019,2020,2021,2022,"янв-август 2023"]
["C","Обрабатывающая промышленность",14033.971500000001,12650.548500000001,15554.402300000002,15744.732558830019,15826.144630729998,15455.891509690033,19826.852511360001,26814.085376990064,{"$f":"VLOOKUP(A3,'к стр8 и 9'!$A:$B,2,0)/1000","v":16208.625786949993}]
["10","Производство продуктов питания",912.89730000000009,917.4117,1076.1351999999999,1176.1766826199998,1051.1166490299991,1287.3775918900035,1306.4825438499995,2309.8879760299919,{"$f":"VLOOKUP(A4,'к стр8 и 9'!$A:$B,2,0)/1000","v":1365.9422779600006}]
["11","Производство напитков",49.508199999999995,52.1342,46.566099999999999,55.649092429999996,60.220110669999997,72.522835080000021,91.728765809999928,169.67791767000006,{"$f":"VLOOKUP(A5,'к стр8 и 9'!$A:$B,2,0)/1000","v":158.17403662999999}]
["12","Производство табачных изделий",108.3687,110.9639,92.345500000000001,96.816646230000018,93.078369310000014,61.23401336000002,67.333726360000014,96.47808394999997,{"$f":"VLOOKUP(A6,'к стр8 и 9'!$A:$B,2,0)/1000","v":75.887630730000012}]
{"$rows_left_out":20}